Tk-Components

Artifact Content
Login

Artifact e7cd9c82097072c1cf01aea5331ffbafa2b7dbdf:


This file contains any messages produced by compilers while
running configure, to aid debugging if configure makes a mistake.

It was created by cocoaprint configure 1.3, which was
generated by GNU Autoconf 2.61.  Invocation command line was

  $ ./configure --prefix=/usr/local --libdir=/Library/Tcl --with-tcl=/Library/Frameworks/Tcl.framework --with-tclinclude=/Library/Frameworks/Tcl.framework/Headers --with-tk=/Library/Frameworks/Tk.framework --with-tkinclude=/Library/Frameworks/Tk.framework/Headers --enable-threads

## --------- ##
## Platform. ##
## --------- ##

hostname = Kevin-Walzers-MacBook.local
uname -m = i386
uname -r = 10.7.0
uname -s = Darwin
uname -v = Darwin Kernel Version 10.7.0: Sat Jan 29 15:17:16 PST 2011; root:xnu-1504.9.37~1/RELEASE_I386

/usr/bin/uname -p = i386
/bin/uname -X     = unknown

/bin/arch              = unknown
/usr/bin/arch -k       = unknown
/usr/convex/getsysinfo = unknown
/usr/bin/hostinfo      = Mach kernel version:
	 Darwin Kernel Version 10.7.0: Sat Jan 29 15:17:16 PST 2011; root:xnu-1504.9.37~1/RELEASE_I386
Kernel configured for up to 2 processors.
2 processors are physically available.
2 processors are logically available.
Processor type: i486 (Intel 80486)
Processors active: 0 1
Primary memory available: 4.00 gigabytes
Default processor set: 86 tasks, 395 threads, 2 processors
Load average: 1.43, Mach factor: 0.87
/bin/machine           = unknown
/usr/bin/oslevel       = unknown
/bin/universe          = unknown

PATH: /opt/local/bin
PATH: /opt/local/sbin
PATH: /Users/kevin/.local/bin
PATH: /Library/Frameworks/Python.framework/Versions/Current/bin
PATH: /usr/bin
PATH: /bin
PATH: /usr/sbin
PATH: /sbin
PATH: /usr/local/bin
PATH: /usr/X11/bin
PATH: /usr/local/bin
PATH: /Developer/Tools
PATH: /opt/local/bin
PATH: /Users/kevin/.local/bin


## ----------- ##
## Core tests. ##
## ----------- ##

configure:1803: checking for correct TEA configuration
configure:1822: result: ok (TEA 3.7)
configure:1956: checking for Tcl configuration
configure:2082: result: found /Library/Frameworks/Tcl.framework/tclConfig.sh
configure:2088: checking for existence of /Library/Frameworks/Tcl.framework/tclConfig.sh
configure:2092: result: loading
configure:2183: checking for Tk configuration
configure:2309: result: found /Library/Frameworks/Tk.framework/tkConfig.sh
configure:2315: checking for existence of /Library/Frameworks/Tk.framework/tkConfig.sh
configure:2319: result: loading
configure:2427: --exec-prefix defaulting to TCL_EXEC_PREFIX /usr/local
configure:2503: checking for gcc
configure:2519: found /usr/bin/gcc
configure:2530: result: gcc
configure:2768: checking for C compiler version
configure:2775: gcc --version >&5
i686-apple-darwin10-gcc-4.2.1 (GCC) 4.2.1 (Apple Inc. build 5666) (dot 3)
Copyright (C) 2007 Free Software Foundation, Inc.
This is free software; see the source for copying conditions.  There is NO
warranty; not even for MERCHANTABILITY or FITNESS FOR A PARTICULAR PURPOSE.

configure:2778: $? = 0
configure:2785: gcc -v >&5
Using built-in specs.
Target: i686-apple-darwin10
Configured with: /var/tmp/gcc/gcc-5666.3~123/src/configure --disable-checking --enable-werror --prefix=/usr --mandir=/share/man --enable-languages=c,objc,c++,obj-c++ --program-transform-name=/^[cg][^.-]*$/s/$/-4.2/ --with-slibdir=/usr/lib --build=i686-apple-darwin10 --program-prefix=i686-apple-darwin10- --host=x86_64-apple-darwin10 --target=i686-apple-darwin10 --with-gxx-include-dir=/include/c++/4.2.1
Thread model: posix
gcc version 4.2.1 (Apple Inc. build 5666) (dot 3)
configure:2788: $? = 0
configure:2795: gcc -V >&5
gcc-4.2: argument to `-V' is missing
configure:2798: $? = 1
configure:2821: checking for C compiler default output file name
configure:2848: gcc -arch i386  -arch x86_64 -fobjc-gc   -arch i386 -arch x86_64 -fobjc-gc  conftest.c  >&5
cc1: warning: command line option "-fobjc-gc" is valid for ObjC/ObjC++ but not for C
cc1: warning: command line option "-fobjc-gc" is valid for ObjC/ObjC++ but not for C
configure:2851: $? = 0
configure:2889: result: a.out
configure:2906: checking whether the C compiler works
configure:2916: ./a.out
configure:2919: $? = 0
configure:2936: result: yes
configure:2943: checking whether we are cross compiling
configure:2945: result: no
configure:2948: checking for suffix of executables
configure:2955: gcc -o conftest -arch i386  -arch x86_64 -fobjc-gc   -arch i386 -arch x86_64 -fobjc-gc  conftest.c  >&5
cc1: warning: command line option "-fobjc-gc" is valid for ObjC/ObjC++ but not for C
cc1: warning: command line option "-fobjc-gc" is valid for ObjC/ObjC++ but not for C
configure:2958: $? = 0
configure:2982: result: 
configure:2988: checking for suffix of object files
configure:3014: gcc -c -arch i386  -arch x86_64 -fobjc-gc  conftest.c >&5
cc1: warning: command line option "-fobjc-gc" is valid for ObjC/ObjC++ but not for C
cc1: warning: command line option "-fobjc-gc" is valid for ObjC/ObjC++ but not for C
configure:3017: $? = 0
configure:3040: result: o
configure:3044: checking whether we are using the GNU C compiler
configure:3073: gcc -c -arch i386  -arch x86_64 -fobjc-gc  conftest.c >&5
cc1: warning: command line option "-fobjc-gc" is valid for ObjC/ObjC++ but not for C
cc1: warning: command line option "-fobjc-gc" is valid for ObjC/ObjC++ but not for C
configure:3079: $? = 0
configure:3096: result: yes
configure:3101: checking whether gcc accepts -g
configure:3131: gcc -c -g  conftest.c >&5
configure:3137: $? = 0
configure:3236: result: yes
configure:3253: checking for gcc option to accept ISO C89
configure:3327: gcc  -c -arch i386  -arch x86_64 -fobjc-gc  conftest.c >&5
cc1: warning: command line option "-fobjc-gc" is valid for ObjC/ObjC++ but not for C
cc1: warning: command line option "-fobjc-gc" is valid for ObjC/ObjC++ but not for C
configure:3333: $? = 0
configure:3356: result: none needed
configure:3379: checking how to run the C preprocessor
configure:3419: gcc -E  conftest.c
configure:3425: $? = 0
configure:3456: gcc -E  conftest.c
conftest.c:9:28: error: ac_nonexistent.h: No such file or directory
configure:3462: $? = 1
configure: failed program was:
| /* confdefs.h.  */
| #define PACKAGE_NAME "cocoaprint"
| #define PACKAGE_TARNAME "cocoaprint"
| #define PACKAGE_VERSION "1.3"
| #define PACKAGE_STRING "cocoaprint 1.3"
| #define PACKAGE_BUGREPORT ""
| #define MAC_OSX_TK 1
| /* end confdefs.h.  */
| #include <ac_nonexistent.h>
configure:3495: result: gcc -E
configure:3524: gcc -E  conftest.c
configure:3530: $? = 0
configure:3561: gcc -E  conftest.c
conftest.c:9:28: error: ac_nonexistent.h: No such file or directory
configure:3567: $? = 1
configure: failed program was:
| /* confdefs.h.  */
| #define PACKAGE_NAME "cocoaprint"
| #define PACKAGE_TARNAME "cocoaprint"
| #define PACKAGE_VERSION "1.3"
| #define PACKAGE_STRING "cocoaprint 1.3"
| #define PACKAGE_BUGREPORT ""
| #define MAC_OSX_TK 1
| /* end confdefs.h.  */
| #include <ac_nonexistent.h>
configure:3618: checking for a BSD-compatible install
configure:3674: result: /usr/bin/install -c
configure:3690: checking whether make sets $(MAKE)
configure:3711: result: yes
configure:3768: checking for ranlib
configure:3784: found /usr/bin/ranlib
configure:3795: result: ranlib
configure:3831: checking for grep that handles long lines and -e
configure:3905: result: /usr/bin/grep
configure:3910: checking for egrep
configure:3988: result: /usr/bin/grep -E
configure:3993: checking for ANSI C header files
configure:4023: gcc -c -arch i386  -arch x86_64 -fobjc-gc  conftest.c >&5
cc1: warning: command line option "-fobjc-gc" is valid for ObjC/ObjC++ but not for C
cc1: warning: command line option "-fobjc-gc" is valid for ObjC/ObjC++ but not for C
configure:4029: $? = 0
configure:4128: gcc -o conftest -arch i386  -arch x86_64 -fobjc-gc   -arch i386 -arch x86_64 -fobjc-gc  conftest.c  >&5
cc1: warning: command line option "-fobjc-gc" is valid for ObjC/ObjC++ but not for C
cc1: warning: command line option "-fobjc-gc" is valid for ObjC/ObjC++ but not for C
configure:4131: $? = 0
configure:4137: ./conftest
configure:4140: $? = 0
configure:4157: result: yes
configure:4181: checking for sys/types.h
configure:4202: gcc -c -arch i386  -arch x86_64 -fobjc-gc  conftest.c >&5
cc1: warning: command line option "-fobjc-gc" is valid for ObjC/ObjC++ but not for C
cc1: warning: command line option "-fobjc-gc" is valid for ObjC/ObjC++ but not for C
configure:4208: $? = 0
configure:4224: result: yes
configure:4181: checking for sys/stat.h
configure:4202: gcc -c -arch i386  -arch x86_64 -fobjc-gc  conftest.c >&5
cc1: warning: command line option "-fobjc-gc" is valid for ObjC/ObjC++ but not for C
cc1: warning: command line option "-fobjc-gc" is valid for ObjC/ObjC++ but not for C
configure:4208: $? = 0
configure:4224: result: yes
configure:4181: checking for stdlib.h
configure:4202: gcc -c -arch i386  -arch x86_64 -fobjc-gc  conftest.c >&5
cc1: warning: command line option "-fobjc-gc" is valid for ObjC/ObjC++ but not for C
cc1: warning: command line option "-fobjc-gc" is valid for ObjC/ObjC++ but not for C
configure:4208: $? = 0
configure:4224: result: yes
configure:4181: checking for string.h
configure:4202: gcc -c -arch i386  -arch x86_64 -fobjc-gc  conftest.c >&5
cc1: warning: command line option "-fobjc-gc" is valid for ObjC/ObjC++ but not for C
cc1: warning: command line option "-fobjc-gc" is valid for ObjC/ObjC++ but not for C
configure:4208: $? = 0
configure:4224: result: yes
configure:4181: checking for memory.h
configure:4202: gcc -c -arch i386  -arch x86_64 -fobjc-gc  conftest.c >&5
cc1: warning: command line option "-fobjc-gc" is valid for ObjC/ObjC++ but not for C
cc1: warning: command line option "-fobjc-gc" is valid for ObjC/ObjC++ but not for C
configure:4208: $? = 0
configure:4224: result: yes
configure:4181: checking for strings.h
configure:4202: gcc -c -arch i386  -arch x86_64 -fobjc-gc  conftest.c >&5
cc1: warning: command line option "-fobjc-gc" is valid for ObjC/ObjC++ but not for C
cc1: warning: command line option "-fobjc-gc" is valid for ObjC/ObjC++ but not for C
configure:4208: $? = 0
configure:4224: result: yes
configure:4181: checking for inttypes.h
configure:4202: gcc -c -arch i386  -arch x86_64 -fobjc-gc  conftest.c >&5
cc1: warning: command line option "-fobjc-gc" is valid for ObjC/ObjC++ but not for C
cc1: warning: command line option "-fobjc-gc" is valid for ObjC/ObjC++ but not for C
configure:4208: $? = 0
configure:4224: result: yes
configure:4181: checking for stdint.h
configure:4202: gcc -c -arch i386  -arch x86_64 -fobjc-gc  conftest.c >&5
cc1: warning: command line option "-fobjc-gc" is valid for ObjC/ObjC++ but not for C
cc1: warning: command line option "-fobjc-gc" is valid for ObjC/ObjC++ but not for C
configure:4208: $? = 0
configure:4224: result: yes
configure:4181: checking for unistd.h
configure:4202: gcc -c -arch i386  -arch x86_64 -fobjc-gc  conftest.c >&5
cc1: warning: command line option "-fobjc-gc" is valid for ObjC/ObjC++ but not for C
cc1: warning: command line option "-fobjc-gc" is valid for ObjC/ObjC++ but not for C
configure:4208: $? = 0
configure:4224: result: yes
configure:4246: checking if the compiler understands -pipe
configure:4274: gcc -c -arch i386  -arch x86_64 -fobjc-gc -pipe  conftest.c >&5
cc1: warning: command line option "-fobjc-gc" is valid for ObjC/ObjC++ but not for C
cc1: warning: command line option "-fobjc-gc" is valid for ObjC/ObjC++ but not for C
configure:4280: $? = 0
configure:4296: result: yes
configure:4307: checking whether byte ordering is bigendian
configure:4340: gcc -c -arch i386  -arch x86_64 -fobjc-gc -pipe  conftest.c >&5
cc1: warning: command line option "-fobjc-gc" is valid for ObjC/ObjC++ but not for C
cc1: warning: command line option "-fobjc-gc" is valid for ObjC/ObjC++ but not for C
configure:4346: $? = 0
configure:4378: gcc -c -arch i386  -arch x86_64 -fobjc-gc -pipe  conftest.c >&5
cc1: warning: command line option "-fobjc-gc" is valid for ObjC/ObjC++ but not for C
conftest.c: In function 'main':
conftest.c:26: error: 'not' undeclared (first use in this function)
conftest.c:26: error: (Each undeclared identifier is reported only once
conftest.c:26: error: for each function it appears in.)
conftest.c:26: error: expected ';' before 'big'
cc1: warning: command line option "-fobjc-gc" is valid for ObjC/ObjC++ but not for C
conftest.c: In function 'main':
conftest.c:26: error: 'not' undeclared (first use in this function)
conftest.c:26: error: (Each undeclared identifier is reported only once
conftest.c:26: error: for each function it appears in.)
conftest.c:26: error: expected ';' before 'big'
lipo: can't open input file: /var/folders/hp/hpRdAdiTH44edi9Qgwd1Hk+++TI/-Tmp-//ccR5TQWT.out (No such file or directory)
configure:4384: $? = 1
configure: failed program was:
| /* confdefs.h.  */
| #define PACKAGE_NAME "cocoaprint"
| #define PACKAGE_TARNAME "cocoaprint"
| #define PACKAGE_VERSION "1.3"
| #define PACKAGE_STRING "cocoaprint 1.3"
| #define PACKAGE_BUGREPORT ""
| #define MAC_OSX_TK 1
| #define STDC_HEADERS 1
| #define HAVE_SYS_TYPES_H 1
| #define HAVE_SYS_STAT_H 1
| #define HAVE_STDLIB_H 1
| #define HAVE_STRING_H 1
| #define HAVE_MEMORY_H 1
| #define HAVE_STRINGS_H 1
| #define HAVE_INTTYPES_H 1
| #define HAVE_STDINT_H 1
| #define HAVE_UNISTD_H 1
| /* end confdefs.h.  */
| #include <sys/types.h>
| #include <sys/param.h>
| 
| int
| main ()
| {
| #if BYTE_ORDER != BIG_ENDIAN
|  not big endian
| #endif
| 
|   ;
|   return 0;
| }
configure:4524: result: no
configure:4552: checking for sin
configure:4608: gcc -o conftest -arch i386  -arch x86_64 -fobjc-gc -pipe   -arch i386 -arch x86_64 -fobjc-gc  conftest.c  >&5
cc1: warning: command line option "-fobjc-gc" is valid for ObjC/ObjC++ but not for C
conftest.c:42: warning: conflicting types for built-in function 'sin'
cc1: warning: command line option "-fobjc-gc" is valid for ObjC/ObjC++ but not for C
conftest.c:42: warning: conflicting types for built-in function 'sin'
configure:4614: $? = 0
configure:4631: result: yes
configure:4639: checking for main in -lieee
configure:4668: gcc -o conftest -arch i386  -arch x86_64 -fobjc-gc -pipe   -arch i386 -arch x86_64 -fobjc-gc  conftest.c -lieee   >&5
cc1: warning: command line option "-fobjc-gc" is valid for ObjC/ObjC++ but not for C
ld: library not found for -lieee
collect2: ld returned 1 exit status
cc1: warning: command line option "-fobjc-gc" is valid for ObjC/ObjC++ but not for C
ld: library not found for -lieee
collect2: ld returned 1 exit status
lipo: can't open input file: /var/folders/hp/hpRdAdiTH44edi9Qgwd1Hk+++TI/-Tmp-//cc5Cbaoz.out (No such file or directory)
configure:4674: $? = 1
configure: failed program was:
| /* confdefs.h.  */
| #define PACKAGE_NAME "cocoaprint"
| #define PACKAGE_TARNAME "cocoaprint"
| #define PACKAGE_VERSION "1.3"
| #define PACKAGE_STRING "cocoaprint 1.3"
| #define PACKAGE_BUGREPORT ""
| #define MAC_OSX_TK 1
| #define STDC_HEADERS 1
| #define HAVE_SYS_TYPES_H 1
| #define HAVE_SYS_STAT_H 1
| #define HAVE_STDLIB_H 1
| #define HAVE_STRING_H 1
| #define HAVE_MEMORY_H 1
| #define HAVE_STRINGS_H 1
| #define HAVE_INTTYPES_H 1
| #define HAVE_STDINT_H 1
| #define HAVE_UNISTD_H 1
| /* end confdefs.h.  */
| 
| 
| int
| main ()
| {
| return main ();
|   ;
|   return 0;
| }
configure:4692: result: no
configure:4704: checking for main in -linet
configure:4733: gcc -o conftest -arch i386  -arch x86_64 -fobjc-gc -pipe   -arch i386 -arch x86_64 -fobjc-gc  conftest.c -linet   >&5
cc1: warning: command line option "-fobjc-gc" is valid for ObjC/ObjC++ but not for C
ld: library not found for -linet
collect2: ld returned 1 exit status
cc1: warning: command line option "-fobjc-gc" is valid for ObjC/ObjC++ but not for C
ld: library not found for -linet
collect2: ld returned 1 exit status
lipo: can't open input file: /var/folders/hp/hpRdAdiTH44edi9Qgwd1Hk+++TI/-Tmp-//ccZQBVVa.out (No such file or directory)
configure:4739: $? = 1
configure: failed program was:
| /* confdefs.h.  */
| #define PACKAGE_NAME "cocoaprint"
| #define PACKAGE_TARNAME "cocoaprint"
| #define PACKAGE_VERSION "1.3"
| #define PACKAGE_STRING "cocoaprint 1.3"
| #define PACKAGE_BUGREPORT ""
| #define MAC_OSX_TK 1
| #define STDC_HEADERS 1
| #define HAVE_SYS_TYPES_H 1
| #define HAVE_SYS_STAT_H 1
| #define HAVE_STDLIB_H 1
| #define HAVE_STRING_H 1
| #define HAVE_MEMORY_H 1
| #define HAVE_STRINGS_H 1
| #define HAVE_INTTYPES_H 1
| #define HAVE_STDINT_H 1
| #define HAVE_UNISTD_H 1
| /* end confdefs.h.  */
| 
| 
| int
| main ()
| {
| return main ();
|   ;
|   return 0;
| }
configure:4757: result: no
configure:4773: checking net/errno.h usability
configure:4790: gcc -c -arch i386  -arch x86_64 -fobjc-gc -pipe  conftest.c >&5
cc1: warning: command line option "-fobjc-gc" is valid for ObjC/ObjC++ but not for C
conftest.c:52:23: error: net/errno.h: No such file or directory
cc1: warning: command line option "-fobjc-gc" is valid for ObjC/ObjC++ but not for C
conftest.c:52:23: error: net/errno.h: No such file or directory
lipo: can't open input file: /var/folders/hp/hpRdAdiTH44edi9Qgwd1Hk+++TI/-Tmp-//ccYv9U5k.out (No such file or directory)
configure:4796: $? = 1
configure: failed program was:
| /* confdefs.h.  */
| #define PACKAGE_NAME "cocoaprint"
| #define PACKAGE_TARNAME "cocoaprint"
| #define PACKAGE_VERSION "1.3"
| #define PACKAGE_STRING "cocoaprint 1.3"
| #define PACKAGE_BUGREPORT ""
| #define MAC_OSX_TK 1
| #define STDC_HEADERS 1
| #define HAVE_SYS_TYPES_H 1
| #define HAVE_SYS_STAT_H 1
| #define HAVE_STDLIB_H 1
| #define HAVE_STRING_H 1
| #define HAVE_MEMORY_H 1
| #define HAVE_STRINGS_H 1
| #define HAVE_INTTYPES_H 1
| #define HAVE_STDINT_H 1
| #define HAVE_UNISTD_H 1
| /* end confdefs.h.  */
| #include <stdio.h>
| #ifdef HAVE_SYS_TYPES_H
| # include <sys/types.h>
| #endif
| #ifdef HAVE_SYS_STAT_H
| # include <sys/stat.h>
| #endif
| #ifdef STDC_HEADERS
| # include <stdlib.h>
| # include <stddef.h>
| #else
| # ifdef HAVE_STDLIB_H
| #  include <stdlib.h>
| # endif
| #endif
| #ifdef HAVE_STRING_H
| # if !defined STDC_HEADERS && defined HAVE_MEMORY_H
| #  include <memory.h>
| # endif
| # include <string.h>
| #endif
| #ifdef HAVE_STRINGS_H
| # include <strings.h>
| #endif
| #ifdef HAVE_INTTYPES_H
| # include <inttypes.h>
| #endif
| #ifdef HAVE_STDINT_H
| # include <stdint.h>
| #endif
| #ifdef HAVE_UNISTD_H
| # include <unistd.h>
| #endif
| #include <net/errno.h>
configure:4810: result: no
configure:4814: checking net/errno.h presence
configure:4829: gcc -E  conftest.c
conftest.c:19:23: error: net/errno.h: No such file or directory
configure:4835: $? = 1
configure: failed program was:
| /* confdefs.h.  */
| #define PACKAGE_NAME "cocoaprint"
| #define PACKAGE_TARNAME "cocoaprint"
| #define PACKAGE_VERSION "1.3"
| #define PACKAGE_STRING "cocoaprint 1.3"
| #define PACKAGE_BUGREPORT ""
| #define MAC_OSX_TK 1
| #define STDC_HEADERS 1
| #define HAVE_SYS_TYPES_H 1
| #define HAVE_SYS_STAT_H 1
| #define HAVE_STDLIB_H 1
| #define HAVE_STRING_H 1
| #define HAVE_MEMORY_H 1
| #define HAVE_STRINGS_H 1
| #define HAVE_INTTYPES_H 1
| #define HAVE_STDINT_H 1
| #define HAVE_UNISTD_H 1
| /* end confdefs.h.  */
| #include <net/errno.h>
configure:4849: result: no
configure:4877: checking for net/errno.h
configure:4884: result: no
configure:4918: checking for connect
configure:4974: gcc -o conftest -arch i386  -arch x86_64 -fobjc-gc -pipe   -arch i386 -arch x86_64 -fobjc-gc  conftest.c  >&5
cc1: warning: command line option "-fobjc-gc" is valid for ObjC/ObjC++ but not for C
cc1: warning: command line option "-fobjc-gc" is valid for ObjC/ObjC++ but not for C
configure:4980: $? = 0
configure:4997: result: yes
configure:5251: checking for gethostbyname
configure:5307: gcc -o conftest -arch i386  -arch x86_64 -fobjc-gc -pipe   -arch i386 -arch x86_64 -fobjc-gc  conftest.c  >&5
cc1: warning: command line option "-fobjc-gc" is valid for ObjC/ObjC++ but not for C
cc1: warning: command line option "-fobjc-gc" is valid for ObjC/ObjC++ but not for C
configure:5313: $? = 0
configure:5330: result: yes
configure:5411: checking dirent.h
configure:5457: gcc -o conftest -arch i386  -arch x86_64 -fobjc-gc -pipe   -arch i386 -arch x86_64 -fobjc-gc  conftest.c  >&5
cc1: warning: command line option "-fobjc-gc" is valid for ObjC/ObjC++ but not for C
cc1: warning: command line option "-fobjc-gc" is valid for ObjC/ObjC++ but not for C
configure:5463: $? = 0
configure:5480: result: yes
configure:5502: checking errno.h usability
configure:5519: gcc -c -arch i386  -arch x86_64 -fobjc-gc -pipe  conftest.c >&5
cc1: warning: command line option "-fobjc-gc" is valid for ObjC/ObjC++ but not for C
cc1: warning: command line option "-fobjc-gc" is valid for ObjC/ObjC++ but not for C
configure:5525: $? = 0
configure:5539: result: yes
configure:5543: checking errno.h presence
configure:5558: gcc -E  conftest.c
configure:5564: $? = 0
configure:5578: result: yes
configure:5606: checking for errno.h
configure:5613: result: yes
configure:5638: checking float.h usability
configure:5655: gcc -c -arch i386  -arch x86_64 -fobjc-gc -pipe  conftest.c >&5
cc1: warning: command line option "-fobjc-gc" is valid for ObjC/ObjC++ but not for C
cc1: warning: command line option "-fobjc-gc" is valid for ObjC/ObjC++ but not for C
configure:5661: $? = 0
configure:5675: result: yes
configure:5679: checking float.h presence
configure:5694: gcc -E  conftest.c
configure:5700: $? = 0
configure:5714: result: yes
configure:5742: checking for float.h
configure:5749: result: yes
configure:5774: checking values.h usability
configure:5791: gcc -c -arch i386  -arch x86_64 -fobjc-gc -pipe  conftest.c >&5
cc1: warning: command line option "-fobjc-gc" is valid for ObjC/ObjC++ but not for C
conftest.c:52:20: error: values.h: No such file or directory
cc1: warning: command line option "-fobjc-gc" is valid for ObjC/ObjC++ but not for C
conftest.c:52:20: error: values.h: No such file or directory
lipo: can't open input file: /var/folders/hp/hpRdAdiTH44edi9Qgwd1Hk+++TI/-Tmp-//ccb9Kj2N.out (No such file or directory)
configure:5797: $? = 1
configure: failed program was:
| /* confdefs.h.  */
| #define PACKAGE_NAME "cocoaprint"
| #define PACKAGE_TARNAME "cocoaprint"
| #define PACKAGE_VERSION "1.3"
| #define PACKAGE_STRING "cocoaprint 1.3"
| #define PACKAGE_BUGREPORT ""
| #define MAC_OSX_TK 1
| #define STDC_HEADERS 1
| #define HAVE_SYS_TYPES_H 1
| #define HAVE_SYS_STAT_H 1
| #define HAVE_STDLIB_H 1
| #define HAVE_STRING_H 1
| #define HAVE_MEMORY_H 1
| #define HAVE_STRINGS_H 1
| #define HAVE_INTTYPES_H 1
| #define HAVE_STDINT_H 1
| #define HAVE_UNISTD_H 1
| /* end confdefs.h.  */
| #include <stdio.h>
| #ifdef HAVE_SYS_TYPES_H
| # include <sys/types.h>
| #endif
| #ifdef HAVE_SYS_STAT_H
| # include <sys/stat.h>
| #endif
| #ifdef STDC_HEADERS
| # include <stdlib.h>
| # include <stddef.h>
| #else
| # ifdef HAVE_STDLIB_H
| #  include <stdlib.h>
| # endif
| #endif
| #ifdef HAVE_STRING_H
| # if !defined STDC_HEADERS && defined HAVE_MEMORY_H
| #  include <memory.h>
| # endif
| # include <string.h>
| #endif
| #ifdef HAVE_STRINGS_H
| # include <strings.h>
| #endif
| #ifdef HAVE_INTTYPES_H
| # include <inttypes.h>
| #endif
| #ifdef HAVE_STDINT_H
| # include <stdint.h>
| #endif
| #ifdef HAVE_UNISTD_H
| # include <unistd.h>
| #endif
| #include <values.h>
configure:5811: result: no
configure:5815: checking values.h presence
configure:5830: gcc -E  conftest.c
conftest.c:19:20: error: values.h: No such file or directory
configure:5836: $? = 1
configure: failed program was:
| /* confdefs.h.  */
| #define PACKAGE_NAME "cocoaprint"
| #define PACKAGE_TARNAME "cocoaprint"
| #define PACKAGE_VERSION "1.3"
| #define PACKAGE_STRING "cocoaprint 1.3"
| #define PACKAGE_BUGREPORT ""
| #define MAC_OSX_TK 1
| #define STDC_HEADERS 1
| #define HAVE_SYS_TYPES_H 1
| #define HAVE_SYS_STAT_H 1
| #define HAVE_STDLIB_H 1
| #define HAVE_STRING_H 1
| #define HAVE_MEMORY_H 1
| #define HAVE_STRINGS_H 1
| #define HAVE_INTTYPES_H 1
| #define HAVE_STDINT_H 1
| #define HAVE_UNISTD_H 1
| /* end confdefs.h.  */
| #include <values.h>
configure:5850: result: no
configure:5878: checking for values.h
configure:5885: result: no
configure:5910: checking limits.h usability
configure:5927: gcc -c -arch i386  -arch x86_64 -fobjc-gc -pipe  conftest.c >&5
cc1: warning: command line option "-fobjc-gc" is valid for ObjC/ObjC++ but not for C
cc1: warning: command line option "-fobjc-gc" is valid for ObjC/ObjC++ but not for C
configure:5933: $? = 0
configure:5947: result: yes
configure:5951: checking limits.h presence
configure:5966: gcc -E  conftest.c
configure:5972: $? = 0
configure:5986: result: yes
configure:6014: checking for limits.h
configure:6021: result: yes
configure:6041: checking for stdlib.h
configure:6046: result: yes
configure:6231: checking for string.h
configure:6236: result: yes
configure:6418: checking sys/wait.h usability
configure:6435: gcc -c -arch i386  -arch x86_64 -fobjc-gc -pipe  conftest.c >&5
cc1: warning: command line option "-fobjc-gc" is valid for ObjC/ObjC++ but not for C
cc1: warning: command line option "-fobjc-gc" is valid for ObjC/ObjC++ but not for C
configure:6441: $? = 0
configure:6455: result: yes
configure:6459: checking sys/wait.h presence
configure:6474: gcc -E  conftest.c
configure:6480: $? = 0
configure:6494: result: yes
configure:6522: checking for sys/wait.h
configure:6529: result: yes
configure:6554: checking dlfcn.h usability
configure:6571: gcc -c -arch i386  -arch x86_64 -fobjc-gc -pipe  conftest.c >&5
cc1: warning: command line option "-fobjc-gc" is valid for ObjC/ObjC++ but not for C
cc1: warning: command line option "-fobjc-gc" is valid for ObjC/ObjC++ but not for C
configure:6577: $? = 0
configure:6591: result: yes
configure:6595: checking dlfcn.h presence
configure:6610: gcc -E  conftest.c
configure:6616: $? = 0
configure:6630: result: yes
configure:6658: checking for dlfcn.h
configure:6665: result: yes
configure:6697: checking sys/param.h usability
configure:6714: gcc -c -arch i386  -arch x86_64 -fobjc-gc -pipe  conftest.c >&5
cc1: warning: command line option "-fobjc-gc" is valid for ObjC/ObjC++ but not for C
cc1: warning: command line option "-fobjc-gc" is valid for ObjC/ObjC++ but not for C
configure:6720: $? = 0
configure:6734: result: yes
configure:6738: checking sys/param.h presence
configure:6753: gcc -E  conftest.c
configure:6759: $? = 0
configure:6773: result: yes
configure:6801: checking for sys/param.h
configure:6809: result: yes
configure:6996: checking for Tcl public headers
configure:7071: result: /Library/Frameworks/Tcl.framework/Headers
configure:7086: checking for Tcl private include files
configure:7140: result: Using -I"/Library/Frameworks/Tcl.framework/Headers" -I"/Library/Frameworks/Tcl.framework/PrivateHeaders" -I"/Users/kevin/tk859/tcl/generic" -I"/Users/kevin/tk859/tcl/unix"
configure:7145: checking for Tk public headers
configure:7223: result: /Library/Frameworks/Tk.framework/Headers
configure:7237: checking for X11 header files
configure:7244: result: /Library/Frameworks/Tk.framework/Headers
configure:7251: checking for Tk private include files
configure:7317: result: Using -I"/Library/Frameworks/Tk.framework/Headers" -I"/Library/Frameworks/Tk.framework/PrivateHeaders" -I"/Users/kevin/tk859/tk/generic" -I"/Users/kevin/tk859/tk/unix" -I"/Users/kevin/tk859/tk/generic/ttk" -I""/Users/kevin/tk859/tk/xlib"" -I"/Users/kevin/tk859/tk/macosx"
configure:7816: checking for pthread_mutex_init in -lpthread
configure:7851: gcc -o conftest -arch i386  -arch x86_64 -fobjc-gc -pipe   -arch i386 -arch x86_64 -fobjc-gc  conftest.c -lpthread   >&5
cc1: warning: command line option "-fobjc-gc" is valid for ObjC/ObjC++ but not for C
cc1: warning: command line option "-fobjc-gc" is valid for ObjC/ObjC++ but not for C
configure:7857: $? = 0
configure:7875: result: yes
configure:8184: checking for building with threads
configure:8192: result: yes (default)
configure:8233: checking how to build libraries
configure:8251: result: shared
configure:8278: checking if 64bit support is requested
configure:8287: result: no
configure:8292: checking if 64bit Sparc VIS support is requested
configure:8301: result: no
configure:8312: checking if compiler supports visibility "hidden"
configure:8342: gcc -o conftest -arch i386  -arch x86_64 -fobjc-gc -pipe -Werror   -arch i386 -arch x86_64 -fobjc-gc  conftest.c  >&5
cc1: warnings being treated as errors
cc1: warning: command line option "-fobjc-gc" is valid for ObjC/ObjC++ but not for C
cc1: warnings being treated as errors
cc1: warning: command line option "-fobjc-gc" is valid for ObjC/ObjC++ but not for C
lipo: can't figure out the architecture type of: /var/folders/hp/hpRdAdiTH44edi9Qgwd1Hk+++TI/-Tmp-//ccHUnE2H.out
configure:8348: $? = 1
configure: failed program was:
| /* confdefs.h.  */
| #define PACKAGE_NAME "cocoaprint"
| #define PACKAGE_TARNAME "cocoaprint"
| #define PACKAGE_VERSION "1.3"
| #define PACKAGE_STRING "cocoaprint 1.3"
| #define PACKAGE_BUGREPORT ""
| #define MAC_OSX_TK 1
| #define STDC_HEADERS 1
| #define HAVE_SYS_TYPES_H 1
| #define HAVE_SYS_STAT_H 1
| #define HAVE_STDLIB_H 1
| #define HAVE_STRING_H 1
| #define HAVE_MEMORY_H 1
| #define HAVE_STRINGS_H 1
| #define HAVE_INTTYPES_H 1
| #define HAVE_STDINT_H 1
| #define HAVE_UNISTD_H 1
| #define NO_VALUES_H 1
| #define HAVE_LIMITS_H 1
| #define HAVE_SYS_PARAM_H 1
| #define USE_THREAD_ALLOC 1
| #define _REENTRANT 1
| #define _THREAD_SAFE 1
| #define TCL_THREADS 1
| /* end confdefs.h.  */
| 
| 	    extern __attribute__((__visibility__("hidden"))) void f(void);
| 	    void f(void) {}
| int
| main ()
| {
| f();
|   ;
|   return 0;
| }
configure:8366: result: no
configure:8381: checking if rpath support is requested
configure:8390: result: yes
configure:8416: checking system version
configure:8447: result: Darwin-10.7.0
configure:8455: checking for dlopen in -ldl
configure:8490: gcc -o conftest -arch i386  -arch x86_64 -fobjc-gc -pipe   -arch i386 -arch x86_64 -fobjc-gc  conftest.c -ldl   >&5
cc1: warning: command line option "-fobjc-gc" is valid for ObjC/ObjC++ but not for C
cc1: warning: command line option "-fobjc-gc" is valid for ObjC/ObjC++ but not for C
configure:8496: $? = 0
configure:8514: result: yes
configure:8560: checking for ar
configure:8576: found /usr/bin/ar
configure:8587: result: ar
configure:9975: checking if ld accepts -single_module flag
configure:10004: gcc -o conftest -arch i386 -arch x86_64 -fobjc-gc -pipe     -arch i386 -arch x86_64 -fobjc-gc  -dynamiclib -Wl,-single_module conftest.c  >&5
cc1: warning: command line option "-fobjc-gc" is valid for ObjC/ObjC++ but not for C
cc1: warning: command line option "-fobjc-gc" is valid for ObjC/ObjC++ but not for C
configure:10010: $? = 0
configure:10028: result: yes
configure:10051: checking if ld accepts -search_paths_first flag
configure:10080: gcc -o conftest -arch i386 -arch x86_64 -fobjc-gc -pipe     -arch i386 -arch x86_64 -fobjc-gc  -prebind -headerpad_max_install_names -Wl,-search_paths_first conftest.c  >&5
cc1: warning: command line option "-fobjc-gc" is valid for ObjC/ObjC++ but not for C
cc1: warning: command line option "-fobjc-gc" is valid for ObjC/ObjC++ but not for C
configure:10086: $? = 0
configure:10104: result: yes
configure:10196: checking for 64-bit Tk
configure:10228: gcc -o conftest  -arch x86_64 -fobjc-gc -pipe      -DUSE_TCL_STUBS=1 -DUSE_TK_STUBS=1 -I"/Library/Frameworks/Tcl.framework/Headers" -I"/Library/Frameworks/Tcl.framework/PrivateHeaders" -I"/Users/kevin/tk859/tcl/generic" -I"/Users/kevin/tk859/tcl/unix" -I"/Library/Frameworks/Tk.framework/Headers" -I"/Library/Frameworks/Tk.framework/PrivateHeaders" -I"/Users/kevin/tk859/tk/generic" -I"/Users/kevin/tk859/tk/unix" -I"/Users/kevin/tk859/tk/generic/ttk" -I""/Users/kevin/tk859/tk/xlib"" -I"/Users/kevin/tk859/tk/macosx"   -arch x86_64 -fobjc-gc  -prebind -headerpad_max_install_names -Wl,-search_paths_first  -L/Library/Frameworks/Tcl.framework -ltclstub8.5 -L/Library/Frameworks/Tk.framework -ltkstub8.5 conftest.c  >&5
cc1: warning: command line option "-fobjc-gc" is valid for ObjC/ObjC++ but not for C
configure:10234: $? = 0
configure:10254: result: yes
configure:10806: checking for required early compiler flags
configure:10834: gcc -c -arch i386 -arch x86_64 -fobjc-gc -pipe    conftest.c >&5
cc1: warning: command line option "-fobjc-gc" is valid for ObjC/ObjC++ but not for C
cc1: warning: command line option "-fobjc-gc" is valid for ObjC/ObjC++ but not for C
configure:10840: $? = 0
configure:10931: gcc -c -arch i386 -arch x86_64 -fobjc-gc -pipe    conftest.c >&5
cc1: warning: command line option "-fobjc-gc" is valid for ObjC/ObjC++ but not for C
conftest.c: In function 'main':
conftest.c:31: warning: 'stat64' is deprecated (declared at /usr/include/sys/stat.h:465)
cc1: warning: command line option "-fobjc-gc" is valid for ObjC/ObjC++ but not for C
conftest.c: In function 'main':
conftest.c:31: warning: 'stat64' is deprecated (declared at /usr/include/sys/stat.h:465)
configure:10937: $? = 0
configure:11028: gcc -c -arch i386 -arch x86_64 -fobjc-gc -pipe    conftest.c >&5
cc1: warning: command line option "-fobjc-gc" is valid for ObjC/ObjC++ but not for C
conftest.c: In function 'main':
conftest.c:31: error: 'open64' undeclared (first use in this function)
conftest.c:31: error: (Each undeclared identifier is reported only once
conftest.c:31: error: for each function it appears in.)
cc1: warning: command line option "-fobjc-gc" is valid for ObjC/ObjC++ but not for C
conftest.c: In function 'main':
conftest.c:31: error: 'open64' undeclared (first use in this function)
conftest.c:31: error: (Each undeclared identifier is reported only once
conftest.c:31: error: for each function it appears in.)
lipo: can't open input file: /var/folders/hp/hpRdAdiTH44edi9Qgwd1Hk+++TI/-Tmp-//ccw9aw93.out (No such file or directory)
configure:11034: $? = 1
configure: failed program was:
| /* confdefs.h.  */
| #define PACKAGE_NAME "cocoaprint"
| #define PACKAGE_TARNAME "cocoaprint"
| #define PACKAGE_VERSION "1.3"
| #define PACKAGE_STRING "cocoaprint 1.3"
| #define PACKAGE_BUGREPORT ""
| #define MAC_OSX_TK 1
| #define STDC_HEADERS 1
| #define HAVE_SYS_TYPES_H 1
| #define HAVE_SYS_STAT_H 1
| #define HAVE_STDLIB_H 1
| #define HAVE_STRING_H 1
| #define HAVE_MEMORY_H 1
| #define HAVE_STRINGS_H 1
| #define HAVE_INTTYPES_H 1
| #define HAVE_STDINT_H 1
| #define HAVE_UNISTD_H 1
| #define NO_VALUES_H 1
| #define HAVE_LIMITS_H 1
| #define HAVE_SYS_PARAM_H 1
| #define USE_THREAD_ALLOC 1
| #define _REENTRANT 1
| #define _THREAD_SAFE 1
| #define TCL_THREADS 1
| #define MODULE_SCOPE __private_extern__
| /* end confdefs.h.  */
| #include <sys/stat.h>
| int
| main ()
| {
| char *p = (char *)open64;
|   ;
|   return 0;
| }
configure:11066: gcc -c -arch i386 -arch x86_64 -fobjc-gc -pipe    conftest.c >&5
cc1: warning: command line option "-fobjc-gc" is valid for ObjC/ObjC++ but not for C
conftest.c: In function 'main':
conftest.c:32: error: 'open64' undeclared (first use in this function)
conftest.c:32: error: (Each undeclared identifier is reported only once
conftest.c:32: error: for each function it appears in.)
cc1: warning: command line option "-fobjc-gc" is valid for ObjC/ObjC++ but not for C
conftest.c: In function 'main':
conftest.c:32: error: 'open64' undeclared (first use in this function)
conftest.c:32: error: (Each undeclared identifier is reported only once
conftest.c:32: error: for each function it appears in.)
lipo: can't open input file: /var/folders/hp/hpRdAdiTH44edi9Qgwd1Hk+++TI/-Tmp-//ccHiN8Rr.out (No such file or directory)
configure:11072: $? = 1
configure: failed program was:
| /* confdefs.h.  */
| #define PACKAGE_NAME "cocoaprint"
| #define PACKAGE_TARNAME "cocoaprint"
| #define PACKAGE_VERSION "1.3"
| #define PACKAGE_STRING "cocoaprint 1.3"
| #define PACKAGE_BUGREPORT ""
| #define MAC_OSX_TK 1
| #define STDC_HEADERS 1
| #define HAVE_SYS_TYPES_H 1
| #define HAVE_SYS_STAT_H 1
| #define HAVE_STDLIB_H 1
| #define HAVE_STRING_H 1
| #define HAVE_MEMORY_H 1
| #define HAVE_STRINGS_H 1
| #define HAVE_INTTYPES_H 1
| #define HAVE_STDINT_H 1
| #define HAVE_UNISTD_H 1
| #define NO_VALUES_H 1
| #define HAVE_LIMITS_H 1
| #define HAVE_SYS_PARAM_H 1
| #define USE_THREAD_ALLOC 1
| #define _REENTRANT 1
| #define _THREAD_SAFE 1
| #define TCL_THREADS 1
| #define MODULE_SCOPE __private_extern__
| /* end confdefs.h.  */
| #define _LARGEFILE_SOURCE64 1
| #include <sys/stat.h>
| int
| main ()
| {
| char *p = (char *)open64;
|   ;
|   return 0;
| }
configure:11101: result: none
configure:11109: checking for 64-bit integer type
configure:11138: gcc -c -arch i386 -arch x86_64 -fobjc-gc -pipe    conftest.c >&5
cc1: warning: command line option "-fobjc-gc" is valid for ObjC/ObjC++ but not for C
conftest.c: In function 'main':
conftest.c:31: error: '__int64' undeclared (first use in this function)
conftest.c:31: error: (Each undeclared identifier is reported only once
conftest.c:31: error: for each function it appears in.)
conftest.c:31: error: expected ';' before 'value'
cc1: warning: command line option "-fobjc-gc" is valid for ObjC/ObjC++ but not for C
conftest.c: In function 'main':
conftest.c:31: error: '__int64' undeclared (first use in this function)
conftest.c:31: error: (Each undeclared identifier is reported only once
conftest.c:31: error: for each function it appears in.)
conftest.c:31: error: expected ';' before 'value'
lipo: can't open input file: /var/folders/hp/hpRdAdiTH44edi9Qgwd1Hk+++TI/-Tmp-//ccafXCMl.out (No such file or directory)
configure:11144: $? = 1
configure: failed program was:
| /* confdefs.h.  */
| #define PACKAGE_NAME "cocoaprint"
| #define PACKAGE_TARNAME "cocoaprint"
| #define PACKAGE_VERSION "1.3"
| #define PACKAGE_STRING "cocoaprint 1.3"
| #define PACKAGE_BUGREPORT ""
| #define MAC_OSX_TK 1
| #define STDC_HEADERS 1
| #define HAVE_SYS_TYPES_H 1
| #define HAVE_SYS_STAT_H 1
| #define HAVE_STDLIB_H 1
| #define HAVE_STRING_H 1
| #define HAVE_MEMORY_H 1
| #define HAVE_STRINGS_H 1
| #define HAVE_INTTYPES_H 1
| #define HAVE_STDINT_H 1
| #define HAVE_UNISTD_H 1
| #define NO_VALUES_H 1
| #define HAVE_LIMITS_H 1
| #define HAVE_SYS_PARAM_H 1
| #define USE_THREAD_ALLOC 1
| #define _REENTRANT 1
| #define _THREAD_SAFE 1
| #define TCL_THREADS 1
| #define MODULE_SCOPE __private_extern__
| /* end confdefs.h.  */
| 
| int
| main ()
| {
| __int64 value = (__int64) 0;
|   ;
|   return 0;
| }
configure:11184: gcc -c -arch i386 -arch x86_64 -fobjc-gc -pipe    conftest.c >&5
cc1: warning: command line option "-fobjc-gc" is valid for ObjC/ObjC++ but not for C
cc1: warning: command line option "-fobjc-gc" is valid for ObjC/ObjC++ but not for C
conftest.c: In function 'main':
conftest.c:32: error: duplicate case value
conftest.c:32: error: previously used here
lipo: can't open input file: /var/folders/hp/hpRdAdiTH44edi9Qgwd1Hk+++TI/-Tmp-//ccsPsQjI.out (No such file or directory)
configure:11190: $? = 1
configure: failed program was:
| /* confdefs.h.  */
| #define PACKAGE_NAME "cocoaprint"
| #define PACKAGE_TARNAME "cocoaprint"
| #define PACKAGE_VERSION "1.3"
| #define PACKAGE_STRING "cocoaprint 1.3"
| #define PACKAGE_BUGREPORT ""
| #define MAC_OSX_TK 1
| #define STDC_HEADERS 1
| #define HAVE_SYS_TYPES_H 1
| #define HAVE_SYS_STAT_H 1
| #define HAVE_STDLIB_H 1
| #define HAVE_STRING_H 1
| #define HAVE_MEMORY_H 1
| #define HAVE_STRINGS_H 1
| #define HAVE_INTTYPES_H 1
| #define HAVE_STDINT_H 1
| #define HAVE_UNISTD_H 1
| #define NO_VALUES_H 1
| #define HAVE_LIMITS_H 1
| #define HAVE_SYS_PARAM_H 1
| #define USE_THREAD_ALLOC 1
| #define _REENTRANT 1
| #define _THREAD_SAFE 1
| #define TCL_THREADS 1
| #define MODULE_SCOPE __private_extern__
| /* end confdefs.h.  */
| 
| int
| main ()
| {
| switch (0) {
|             case 1: case (sizeof(long long)==sizeof(long)): ;
|         }
|   ;
|   return 0;
| }
configure:11212: result: using long
configure:11517: checking for build with symbols
configure:11530: result: no
configure:11673: checking for tclsh
configure:11700: result: /usr/local/bin/tclsh8.5
configure:11705: checking for wish
configure:11732: result: /usr/local/bin/wish8.5
configure:11876: creating ./config.status

## ---------------------- ##
## Running config.status. ##
## ---------------------- ##

This file was extended by cocoaprint config.status 1.3, which was
generated by GNU Autoconf 2.61.  Invocation command line was

  CONFIG_FILES    = 
  CONFIG_HEADERS  = 
  CONFIG_LINKS    = 
  CONFIG_COMMANDS = 
  $ ./config.status 

on Kevin-Walzers-MacBook.local

config.status:652: creating Makefile
config.status:652: creating pkgIndex.tcl

## ---------------- ##
## Cache variables. ##
## ---------------- ##

ac_cv_c_bigendian=no
ac_cv_c_compiler_gnu=yes
ac_cv_c_tclconfig=/Library/Frameworks/Tcl.framework
ac_cv_c_tclh=/Library/Frameworks/Tcl.framework/Headers
ac_cv_c_tkconfig=/Library/Frameworks/Tk.framework
ac_cv_c_tkh=/Library/Frameworks/Tk.framework/Headers
ac_cv_env_CC_set=
ac_cv_env_CC_value=
ac_cv_env_CFLAGS_set=set
ac_cv_env_CFLAGS_value='-arch i386  -arch x86_64 -fobjc-gc'
ac_cv_env_CPPFLAGS_set=
ac_cv_env_CPPFLAGS_value=
ac_cv_env_CPP_set=
ac_cv_env_CPP_value=
ac_cv_env_LDFLAGS_set=set
ac_cv_env_LDFLAGS_value=' -arch i386 -arch x86_64 -fobjc-gc '
ac_cv_env_LIBS_set=
ac_cv_env_LIBS_value=
ac_cv_env_XMKMF_set=
ac_cv_env_XMKMF_value=
ac_cv_env_build_alias_set=
ac_cv_env_build_alias_value=
ac_cv_env_host_alias_set=
ac_cv_env_host_alias_value=
ac_cv_env_target_alias_set=
ac_cv_env_target_alias_value=
ac_cv_func_connect=yes
ac_cv_func_gethostbyname=yes
ac_cv_func_sin=yes
ac_cv_header_dlfcn_h=yes
ac_cv_header_errno_h=yes
ac_cv_header_float_h=yes
ac_cv_header_inttypes_h=yes
ac_cv_header_limits_h=yes
ac_cv_header_memory_h=yes
ac_cv_header_net_errno_h=no
ac_cv_header_stdc=yes
ac_cv_header_stdint_h=yes
ac_cv_header_stdlib_h=yes
ac_cv_header_string_h=yes
ac_cv_header_strings_h=yes
ac_cv_header_sys_param_h=yes
ac_cv_header_sys_stat_h=yes
ac_cv_header_sys_types_h=yes
ac_cv_header_sys_wait_h=yes
ac_cv_header_unistd_h=yes
ac_cv_header_values_h=no
ac_cv_lib_dl_dlopen=yes
ac_cv_lib_ieee_main=no
ac_cv_lib_inet_main=no
ac_cv_lib_pthread_pthread_mutex_init=yes
ac_cv_objext=o
ac_cv_path_EGREP='/usr/bin/grep -E'
ac_cv_path_GREP=/usr/bin/grep
ac_cv_path_install='/usr/bin/install -c'
ac_cv_prog_AR=ar
ac_cv_prog_CPP='gcc -E'
ac_cv_prog_ac_ct_CC=gcc
ac_cv_prog_ac_ct_RANLIB=ranlib
ac_cv_prog_cc_c89=
ac_cv_prog_cc_g=yes
ac_cv_prog_make_make_set=yes
tcl_cv_cc_pipe=yes
tcl_cv_cc_visibility_hidden=no
tcl_cv_dirent_h=yes
tcl_cv_flag__isoc99_source=no
tcl_cv_flag__largefile64_source=no
tcl_cv_flag__largefile_source64=no
tcl_cv_ld_search_paths_first=yes
tcl_cv_ld_single_module=yes
tcl_cv_lib_tk_64=yes
tcl_cv_sys_version=Darwin-10.7.0
tcl_cv_type_64bit=none

## ----------------- ##
## Output variables. ##
## ----------------- ##

AR='ar'
CC='gcc'
CELIB_DIR=''
CFLAGS='-arch i386 -arch x86_64 -fobjc-gc -pipe  ${CFLAGS_DEFAULT} ${CFLAGS_WARNING} ${SHLIB_CFLAGS}  '
CFLAGS_DEBUG='-g'
CFLAGS_DEFAULT='-Os'
CFLAGS_OPTIMIZE='-Os'
CFLAGS_WARNING='-Wall'
CLEANFILES=''
CPP='gcc -E'
CPPFLAGS=''
CYGPATH='echo'
DEFS='-DPACKAGE_NAME=\"cocoaprint\" -DPACKAGE_TARNAME=\"cocoaprint\" -DPACKAGE_VERSION=\"1.3\" -DPACKAGE_STRING=\"cocoaprint\ 1.3\" -DPACKAGE_BUGREPORT=\"\" -DMAC_OSX_TK=1 -DSTDC_HEADERS=1 -DHAVE_SYS_TYPES_H=1 -DHAVE_SYS_STAT_H=1 -DHAVE_STDLIB_H=1 -DHAVE_STRING_H=1 -DHAVE_MEMORY_H=1 -DHAVE_STRINGS_H=1 -DHAVE_INTTYPES_H=1 -DHAVE_STDINT_H=1 -DHAVE_UNISTD_H=1 -DNO_VALUES_H=1 -DHAVE_LIMITS_H=1 -DHAVE_SYS_PARAM_H=1 -DUSE_THREAD_ALLOC=1 -D_REENTRANT=1 -D_THREAD_SAFE=1 -DTCL_THREADS=1 -DMODULE_SCOPE=__private_extern__ -DTCL_WIDE_INT_IS_LONG=1 -DUSE_TCL_STUBS=1 -DUSE_TK_STUBS=1'
DL_LIBS=''
ECHO_C='ECHO_N=''
ECHO_T=''
EGREP='/usr/bin/grep -E'
EXEEXT=''
GREP='/usr/bin/grep'
INSTALL_DATA='${INSTALL} -m 644'
INSTALL_PROGRAM='${INSTALL}'
INSTALL_SCRIPT='${INSTALL}'
LDFLAGS=' -arch i386 -arch x86_64 -fobjc-gc  -prebind -headerpad_max_install_names -Wl,-search_paths_first '
LDFLAGS_DEFAULT=' -arch i386 -arch x86_64 -fobjc-gc  -prebind -headerpad_max_install_names -Wl,-search_paths_first '
LD_LIBRARY_PATH_VAR='DYLD_LIBRARY_PATH'
LIBOBJS=''
LIBS=''
LTLIBOBJS=''
MAKE_LIB='${SHLIB_LD} -o $@ $(PKG_OBJECTS) ${SHLIB_LD_LIBS} '
MAKE_SHARED_LIB='${SHLIB_LD} -o $@ $(PKG_OBJECTS) ${SHLIB_LD_LIBS}'
MAKE_STATIC_LIB='${STLIB_LD} $@ $(PKG_OBJECTS)'
MAKE_STUB_LIB='${STLIB_LD} $@ $(PKG_STUB_OBJECTS)'
MATH_LIBS=''
OBJEXT='o'
PACKAGE_BUGREPORT=''
PACKAGE_NAME='cocoaprint'
PACKAGE_STRING='cocoaprint 1.3'
PACKAGE_TARNAME='cocoaprint'
PACKAGE_VERSION='1.3'
PATH_SEPARATOR=':'
PKG_CFLAGS=' -std=gnu99  -fobjc-gc'
PKG_HEADERS=''
PKG_INCLUDES=''
PKG_LIBS=' -framework Cocoa -framework Carbon'
PKG_LIB_FILE='libcocoaprint1.3.dylib'
PKG_OBJECTS=' cocoaprint.o'
PKG_SOURCES=' generic/cocoaprint.m'
PKG_STUB_LIB_FILE='libcocoaprintstub1.3.a'
PKG_STUB_OBJECTS=''
PKG_STUB_SOURCES=''
PKG_TCL_SOURCES=''
RANLIB=':'
RANLIB_STUB='ranlib'
SET_MAKE=''
SHARED_BUILD='1'
SHELL='/bin/sh'
SHLIB_CFLAGS='-fno-common'
SHLIB_LD='${CC} -dynamiclib ${CFLAGS} ${LDFLAGS_DEFAULT} -Wl,-single_module -current_version 1.3 -compatibility_version 1.3'
SHLIB_LD_LIBS='${LIBS} -L/Library/Frameworks/Tcl.framework -ltclstub8.5 -L/Library/Frameworks/Tk.framework -ltkstub8.5'
STLIB_LD='${AR} cr'
TCLSH_PROG='/usr/local/bin/tclsh8.5'
TCL_BIN_DIR='/Library/Frameworks/Tcl.framework'
TCL_DBGX=''
TCL_DEFS='-DPACKAGE_NAME=\"tcl\" -DPACKAGE_TARNAME=\"tcl\" -DPACKAGE_VERSION=\"8.5\" -DPACKAGE_STRING=\"tcl\ 8.5\" -DPACKAGE_BUGREPORT=\"\" -DSTDC_HEADERS=1 -DHAVE_SYS_TYPES_H=1 -DHAVE_SYS_STAT_H=1 -DHAVE_STDLIB_H=1 -DHAVE_STRING_H=1 -DHAVE_MEMORY_H=1 -DHAVE_STRINGS_H=1 -DHAVE_INTTYPES_H=1 -DHAVE_STDINT_H=1 -DHAVE_UNISTD_H=1 -DNO_VALUES_H=1 -DHAVE_LIMITS_H=1 -DHAVE_SYS_PARAM_H=1 -DUSE_THREAD_ALLOC=1 -D_REENTRANT=1 -D_THREAD_SAFE=1 -DHAVE_PTHREAD_ATTR_SETSTACKSIZE=1 -DHAVE_PTHREAD_GET_STACKSIZE_NP=1 -DTCL_THREADS=1 -DTCL_CFGVAL_ENCODING=\"iso8859-1\" -DMODULE_SCOPE=__private_extern__ -DMAC_OSX_TCL=1 -DHAVE_COREFOUNDATION=1 -DTCL_SHLIB_EXT=\".dylib\" -DTCL_CFG_OPTIMIZED=1 -DTCL_CFG_DEBUG=1 -DTCL_TOMMATH=1 -DMP_PREC=4 -DTCL_WIDE_INT_IS_LONG=1 -DHAVE_GETCWD=1 -DHAVE_OPENDIR=1 -DHAVE_STRTOL=1 -DHAVE_WAITPID=1 -DHAVE_GETADDRINFO=1 -DHAVE_GETPWUID_R_5=1 -DHAVE_GETPWUID_R=1 -DHAVE_GETPWNAM_R_5=1 -DHAVE_GETPWNAM_R=1 -DHAVE_GETGRGID_R_5=1 -DHAVE_GETGRGID_R=1 -DHAVE_GETGRNAM_R_5=1 -DHAVE_GETGRNAM_R=1 -DHAVE_MTSAFE_GETHOSTBYNAME=1 -DHAVE_MTSAFE_GETHOSTBYADDR=1 -DUSE_TERMIOS=1 -DHAVE_SYS_TIME_H=1 -DTIME_WITH_SYS_TIME=1 -DHAVE_GMTIME_R=1 -DHAVE_LOCALTIME_R=1 -DHAVE_MKTIME=1 -DHAVE_TM_GMTOFF=1 -DHAVE_TIMEZONE_VAR=1 -DHAVE_STRUCT_STAT_ST_BLOCKS=1 -DHAVE_STRUCT_STAT_ST_BLKSIZE=1 -DHAVE_BLKCNT_T=1 -DHAVE_INTPTR_T=1 -DHAVE_UINTPTR_T=1 -DHAVE_SIGNED_CHAR=1 -DHAVE_LANGINFO=1 -DHAVE_CHFLAGS=1 -DHAVE_GETATTRLIST=1 -DHAVE_COPYFILE_H=1 -DHAVE_COPYFILE=1 -DHAVE_LIBKERN_OSATOMIC_H=1 -DHAVE_OSSPINLOCKLOCK=1 -DHAVE_PTHREAD_ATFORK=1 -DUSE_VFORK=1 -DTCL_DEFAULT_ENCODING=\"utf-8\" -DTCL_LOAD_FROM_MEMORY=1 -DTCL_WIDE_CLICKS=1 -DHAVE_AVAILABILITYMACROS_H=1 -DHAVE_FTS=1 -DHAVE_SYS_IOCTL_H=1 -DHAVE_SYS_FILIO_H=1 -DTCL_UNLOAD_DLLS=1 -DUSE_DTRACE=1 -DTCL_FRAMEWORK=1 '
TCL_EXTRA_CFLAGS='-arch i386 -arch x86_64 -fobjc-gc -pipe   '
TCL_INCLUDES='-I"/Library/Frameworks/Tcl.framework/Headers" -I"/Library/Frameworks/Tcl.framework/PrivateHeaders" -I"/Users/kevin/tk859/tcl/generic" -I"/Users/kevin/tk859/tcl/unix"'
TCL_LD_FLAGS=' -arch i386 -arch x86_64 -fobjc-gc  -prebind -headerpad_max_install_names -Wl,-search_paths_first '
TCL_LIBS='${DL_LIBS} ${LIBS} ${MATH_LIBS}'
TCL_LIB_FILE='Tcl'
TCL_LIB_FLAG='-framework Tcl'
TCL_LIB_SPEC='-F/Library/Frameworks -framework Tcl'
TCL_SHLIB_LD_LIBS='${LIBS}'
TCL_SRC_DIR='/Users/kevin/tk859/tcl'
TCL_STUB_LIB_FILE='libtclstub8.5.a'
TCL_STUB_LIB_FLAG='-ltclstub8.5'
TCL_STUB_LIB_SPEC='-L/Library/Frameworks/Tcl.framework -ltclstub8.5'
TCL_THREADS='1'
TCL_TOP_DIR_NATIVE='"/Users/kevin/tk859/tcl"'
TCL_VERSION='8.5'
TK_BIN_DIR='/Library/Frameworks/Tk.framework'
TK_INCLUDES='-I"/Library/Frameworks/Tk.framework/Headers" -I"/Library/Frameworks/Tk.framework/PrivateHeaders" -I"/Users/kevin/tk859/tk/generic" -I"/Users/kevin/tk859/tk/unix" -I"/Users/kevin/tk859/tk/generic/ttk" -I""/Users/kevin/tk859/tk/xlib"" -I"/Users/kevin/tk859/tk/macosx"'
TK_LIBS='   -lpthread -framework CoreFoundation -framework Cocoa -framework Carbon -framework IOKit   -lpthread -framework CoreFoundation '
TK_LIB_FILE='Tk'
TK_LIB_FLAG='-framework Tk'
TK_LIB_SPEC='-F/Library/Frameworks -framework Tk'
TK_SRC_DIR='/Users/kevin/tk859/tk'
TK_STUB_LIB_FILE='libtkstub8.5.a'
TK_STUB_LIB_FLAG='-ltkstub8.5'
TK_STUB_LIB_SPEC='-L/Library/Frameworks/Tk.framework -ltkstub8.5'
TK_TOP_DIR_NATIVE='"/Users/kevin/tk859/tk"'
TK_VERSION='8.5'
TK_XINCLUDES=''
TK_XLIB_DIR_NATIVE='"/Users/kevin/tk859/tk/xlib"'
WISH_PROG='/usr/local/bin/wish8.5'
XMKMF=''
ac_ct_CC='gcc'
bindir='${exec_prefix}/bin'
build_alias=''
datadir='${datarootdir}'
datarootdir='${prefix}/share'
docdir='${datarootdir}/doc/${PACKAGE_TARNAME}'
dvidir='${docdir}'
exec_prefix='/usr/local'
host_alias=''
htmldir='${docdir}'
includedir='${prefix}/include'
infodir='${datarootdir}/info'
libdir='/Library/Tcl'
libexecdir='${exec_prefix}/libexec'
localedir='${datarootdir}/locale'
localstatedir='${prefix}/var'
mandir='${datarootdir}/man'
oldincludedir='/usr/include'
pdfdir='${docdir}'
prefix='/usr/local'
program_transform_name='s,x,x,'
psdir='${docdir}'
sbindir='${exec_prefix}/sbin'
sharedstatedir='${prefix}/com'
sysconfdir='${prefix}/etc'
target_alias=''

## ----------- ##
## confdefs.h. ##
## ----------- ##

#define PACKAGE_NAME "cocoaprint"
#define PACKAGE_TARNAME "cocoaprint"
#define PACKAGE_VERSION "1.3"
#define PACKAGE_STRING "cocoaprint 1.3"
#define PACKAGE_BUGREPORT ""
#define MAC_OSX_TK 1
#define STDC_HEADERS 1
#define HAVE_SYS_TYPES_H 1
#define HAVE_SYS_STAT_H 1
#define HAVE_STDLIB_H 1
#define HAVE_STRING_H 1
#define HAVE_MEMORY_H 1
#define HAVE_STRINGS_H 1
#define HAVE_INTTYPES_H 1
#define HAVE_STDINT_H 1
#define HAVE_UNISTD_H 1
#define NO_VALUES_H 1
#define HAVE_LIMITS_H 1
#define HAVE_SYS_PARAM_H 1
#define USE_THREAD_ALLOC 1
#define _REENTRANT 1
#define _THREAD_SAFE 1
#define TCL_THREADS 1
#define MODULE_SCOPE __private_extern__
#define TCL_WIDE_INT_IS_LONG 1
#define USE_TCL_STUBS 1
#define USE_TK_STUBS 1

configure: exit 0